Information card for entry 1569790
Formula | C82 H88 Ag N O6 P2 S4 Ti |
Calculated formula | C82 H88 Ag N O6 P2 S4 Ti |
Title of publication | Stepwise assembly of thiacalix[4]arene-protected Ag/Ti bimetallic nanoclusters: accurate identification of catalytic Ag sites in CO<sub>2</sub> electroreduction. |
Authors of publication | Tian, Yi-Qi; Mu, Wen-Lei; Wu, Lin-Lin; Yi, Xiao-Yi; Yan, Jun; Liu, Chao |
Journal of publication | Chemical science |
Year of publication | 2023 |
Journal volume | 14 |
Journal issue | 37 |
Pages of publication | 10212 - 10218 |
a | 28.848 ± 0.0012 Å |
b | 11.2724 ± 0.0003 Å |
c | 25.8452 ± 0.001 Å |
α | 90° |
β | 110.243 ± 0.004° |
γ | 90° |
Cell volume | 7885.4 ± 0.5 Å3 |
Cell temperature | 150 K |
Ambient diffraction temperature | 150 K |
Number of distinct elements | 8 |
Space group number | 14 |
Hermann-Mauguin space group symbol | P 1 21/c 1 |
Hall space group symbol | -P 2ybc |
Residual factor for all reflections | 0.0969 |
Residual factor for significantly intense reflections | 0.0465 |
Weighted residual factors for significantly intense reflections | 0.1125 |
Weighted residual factors for all reflections included in the refinement | 0.1336 |
Goodness-of-fit parameter for all reflections included in the refinement | 1.04 |
Diffraction radiation probe | x-ray |
Diffraction radiation wavelength | 0.71073 Å |
Diffraction radiation type | MoKα |