Information card for entry 1570460
Formula | C364 H502 Na4 O113 Ti16 |
Calculated formula | C364 H436 Na4 O80 Ti16 |
Title of publication | Atomically accurate site-specific ligand tailoring of highly acid- and alkali-resistant Ti(iv)-based metallamacrocycle for enhanced CO<sub>2</sub> photoreduction. |
Authors of publication | Tian, Yi-Qi; Dai, Lin-Fang; Mu, Wen-Lei; Yu, Wei-Dong; Yan, Jun; Liu, Chao |
Journal of publication | Chemical science |
Year of publication | 2023 |
Journal volume | 14 |
Journal issue | 48 |
Pages of publication | 14280 - 14289 |
a | 37.982 ± 0.007 Å |
b | 33.195 ± 0.006 Å |
c | 36.904 ± 0.007 Å |
α | 90° |
β | 113.349 ± 0.006° |
γ | 90° |
Cell volume | 42719 ± 14 Å3 |
Cell temperature | 150 K |
Ambient diffraction temperature | 150 K |
Number of distinct elements | 5 |
Space group number | 15 |
Hermann-Mauguin space group symbol | C 1 2/c 1 |
Hall space group symbol | -C 2yc |
Residual factor for all reflections | 0.1313 |
Residual factor for significantly intense reflections | 0.0929 |
Weighted residual factors for significantly intense reflections | 0.2702 |
Weighted residual factors for all reflections included in the refinement | 0.304 |
Goodness-of-fit parameter for all reflections included in the refinement | 1.046 |
Diffraction radiation probe | x-ray |
Diffraction radiation wavelength | 1.34139 Å |
Diffraction radiation type | GaKα |