Information card for entry 1570467
Formula | C198 H235 Na O46 Ti8 |
Calculated formula | C198 H235 Na O46 Ti8 |
Title of publication | Atomically accurate site-specific ligand tailoring of highly acid- and alkali-resistant Ti(iv)-based metallamacrocycle for enhanced CO<sub>2</sub> photoreduction. |
Authors of publication | Tian, Yi-Qi; Dai, Lin-Fang; Mu, Wen-Lei; Yu, Wei-Dong; Yan, Jun; Liu, Chao |
Journal of publication | Chemical science |
Year of publication | 2023 |
Journal volume | 14 |
Journal issue | 48 |
Pages of publication | 14280 - 14289 |
a | 39.095 ± 0.009 Å |
b | 33.277 ± 0.015 Å |
c | 37.714 ± 0.016 Å |
α | 90° |
β | 114.888 ± 0.009° |
γ | 90° |
Cell volume | 44508 ± 3 Å3 |
Cell temperature | 150 ± 2 K |
Ambient diffraction temperature | 150 ± 2 K |
Number of distinct elements | 5 |
Space group number | 15 |
Hermann-Mauguin space group symbol | C 1 2/c 1 |
Hall space group symbol | -C 2yc |
Residual factor for all reflections | 0.1607 |
Residual factor for significantly intense reflections | 0.0962 |
Weighted residual factors for significantly intense reflections | 0.2642 |
Weighted residual factors for all reflections included in the refinement | 0.3136 |
Goodness-of-fit parameter for all reflections included in the refinement | 1.014 |
Diffraction radiation wavelength | 1.34138 Å |
Diffraction radiation type | GaKα |