Information card for entry 1570732
Jmol._Canvas2D (Jmol) "jmolApplet0"[x]
Common name | catena-[bis((4-fluorophenyl)methylammonium) bis(m-iodo)-bis(iodo)-germanium(ii)] |
Formula | C14 H18 F2 Ge I4 N2 |
Calculated formula | C14 H18 F2 Ge I4 N2 |
Title of publication | Homomeric Chains of intermolecular bonds scaffold octahedral germanium perovskites |
Authors of publication | Morteza Najarian, Amin; Dinic, Filip; Chen, Hao; Sabatini, Randy; Zheng, Chao; Lough, Alan J.; Maris, Thierry; Saidaminov, Makhsud I.; Garcia de Arquer, F. Pelayo; Voznyy, Oleksandr; Hoogland, Sjoerd; Sargent, Edward H. |
Journal of publication | Nature |
Year of publication | 2023 |
Journal volume | 620 |
Pages of publication | 328 - 335 |
a | 16.4276 ± 0.0015 Å |
b | 8.2654 ± 0.0008 Å |
c | 8.2637 ± 0.0007 Å |
α | 90° |
β | 98.035 ± 0.003° |
γ | 90° |
Cell volume | 1111.04 ± 0.18 Å3 |
Cell temperature | 150 ± 2 K |
Ambient diffraction temperature | 150 ± 2 K |
Number of distinct elements | 6 |
Space group number | 14 |
Hermann-Mauguin space group symbol | P 1 21/c 1 |
Hall space group symbol | -P 2ybc |
Residual factor for all reflections | 0.0514 |
Residual factor for significantly intense reflections | 0.0306 |
Weighted residual factors for significantly intense reflections | 0.0485 |
Weighted residual factors for all reflections included in the refinement | 0.0524 |
Goodness-of-fit parameter for all reflections included in the refinement | 1.04 |
Diffraction radiation wavelength | 0.71073 Å |
Diffraction radiation type | MoKα |