Information card for entry 1571091
Chemical name | HIAM-4040 |
Formula | C33 H15 N2 O32 Zr6 |
Calculated formula | C33 H15 N2 O32 Zr6 |
Title of publication | Reticular chemistry guided precise construction of zirconium-pentacarboxylate frameworks with 5-connected Zr<sub>6</sub> clusters. |
Authors of publication | Peng, Tianyou; Han, Chao-Qin; Xia, Hai-Lun; Zhou, Kang; Zhang, Jian; Si, Jincheng; Wang, Lei; Miao, Jiafeng; Guo, Fu-An; Wang, Hao; Qu, Lu-Lu; Xu, Guozhong; Li, Jing; Liu, Xiao-Yuan |
Journal of publication | Chemical science |
Year of publication | 2024 |
Journal volume | 15 |
Journal issue | 9 |
Pages of publication | 3174 - 3181 |
a | 13.5866 ± 0.0008 Å |
b | 25.3514 ± 0.0014 Å |
c | 28.7868 ± 0.0015 Å |
α | 90° |
β | 90° |
γ | 90° |
Cell volume | 9915.3 ± 1 Å3 |
Cell temperature | 193 K |
Ambient diffraction temperature | 193 K |
Number of distinct elements | 5 |
Space group number | 19 |
Hermann-Mauguin space group symbol | P 21 21 21 |
Hall space group symbol | P 2ac 2ab |
Residual factor for all reflections | 0.0512 |
Residual factor for significantly intense reflections | 0.0383 |
Weighted residual factors for significantly intense reflections | 0.0878 |
Weighted residual factors for all reflections included in the refinement | 0.092 |
Goodness-of-fit parameter for all reflections included in the refinement | 0.913 |
Diffraction radiation wavelength | 1.34139 Å |
Diffraction radiation type | GaKα |