Information card for entry 1571128
Original IUCr paper | HTML |
Chemical name | Malonic acid 4,4'-bipyridyl |
Formula | C13 H12 N2 O4 |
Calculated formula | C13 H12 N2 O4 |
Title of publication | The curious case of proton migration under pressure in the malonic acid and 4,4'-bipyridine cocrystal. |
Authors of publication | Patyk-Kaźmierczak, Ewa; Izquierdo-Ruiz, Fernando; Lobato, Alvaro; Kaźmierczak, Michał; Moszczyńska, Ida; Olejniczak, Anna; Recio, J. Manuel |
Journal of publication | IUCrJ |
Year of publication | 2024 |
Journal volume | 11 |
Journal issue | 2 |
Pages of publication | 168 - 181 |
a | 19.55 ± 0.005 Å |
b | 4.0396 ± 0.0003 Å |
c | 15.854 ± 0.005 Å |
α | 90° |
β | 104.96 ± 0.04° |
γ | 90° |
Cell volume | 1209.6 ± 0.5 Å3 |
Cell temperature | 298 ± 2 K |
Ambient diffraction temperature | 298 ± 2 K |
Ambient diffracton pressure | 140000 ± 20000 kPa |
Number of distinct elements | 4 |
Space group number | 15 |
Hermann-Mauguin space group symbol | C 1 2/c 1 |
Hall space group symbol | -C 2yc |
Residual factor for all reflections | 0.227 |
Residual factor for significantly intense reflections | 0.0802 |
Weighted residual factors for significantly intense reflections | 0.1594 |
Weighted residual factors for all reflections included in the refinement | 0.2245 |
Goodness-of-fit parameter for all reflections included in the refinement | 0.997 |
Diffraction radiation probe | x-ray |
Diffraction radiation wavelength | 0.71073 Å |
Diffraction radiation type | MoKα |