Information card for entry 1571843
Original IUCr paper | HTML |
Chemical name | (2',6'-dimethoxy-[1,1'-biphenyl]-2-yl)methanol (absorbed in crystalline sponge) |
Formula | C119.57 H84.34 I18 N36 O2.31 Zn9 |
Calculated formula | C119.572 H84.344 I17.9998 N36 O2.3145 Zn8.9999 |
Title of publication | Statistical optimization of guest uptake in crystalline sponges: grading structural outcomes. |
Authors of publication | Carroll, Robert C.; Coles, Simon J. |
Journal of publication | IUCrJ |
Year of publication | 2024 |
Journal volume | 11 |
Journal issue | 4 |
a | 78.8715 ± 0.001 Å |
b | 14.9502 ± 0.0001 Å |
c | 41.6531 ± 0.0004 Å |
α | 90° |
β | 100.102 ± 0.001° |
γ | 90° |
Cell volume | 48353.6 ± 0.8 Å3 |
Cell temperature | 100 ± 2 K |
Ambient diffraction temperature | 100 ± 2 K |
Number of distinct elements | 6 |
Space group number | 15 |
Hermann-Mauguin space group symbol | C 1 2/c 1 |
Hall space group symbol | -C 2yc |
Residual factor for all reflections | 0.112 |
Residual factor for significantly intense reflections | 0.094 |
Weighted residual factors for significantly intense reflections | 0.2889 |
Weighted residual factors for all reflections included in the refinement | 0.3037 |
Goodness-of-fit parameter for all reflections included in the refinement | 1.055 |
Diffraction radiation probe | x-ray |
Diffraction radiation wavelength | 1.54184 Å |
Diffraction radiation type | CuKα |