Information card for entry 1571864
Original IUCr paper | HTML |
Chemical name | (2',6'-dimethoxy-[1,1'-biphenyl]-2-yl)methanol (absorbed in crystalline sponge) |
Formula | C40.42 H28.72 I6 N12 O0.88 Zn3 |
Calculated formula | C40.425 H28.72 I6.001 N12 O0.885 Zn3.0005 |
Title of publication | Statistical optimization of guest uptake in crystalline sponges: grading structural outcomes. |
Authors of publication | Carroll, Robert C.; Coles, Simon J. |
Journal of publication | IUCrJ |
Year of publication | 2024 |
Journal volume | 11 |
Journal issue | 4 |
a | 34.581 ± 0.0014 Å |
b | 14.9867 ± 0.0003 Å |
c | 31.5551 ± 0.0015 Å |
α | 90° |
β | 102.106 ± 0.004° |
γ | 90° |
Cell volume | 15989.9 ± 1.1 Å3 |
Cell temperature | 100 ± 2 K |
Ambient diffraction temperature | 100 ± 2 K |
Number of distinct elements | 6 |
Space group number | 15 |
Hermann-Mauguin space group symbol | C 1 2/c 1 |
Hall space group symbol | -C 2yc |
Residual factor for all reflections | 0.1407 |
Residual factor for significantly intense reflections | 0.1233 |
Weighted residual factors for significantly intense reflections | 0.3522 |
Weighted residual factors for all reflections included in the refinement | 0.365 |
Goodness-of-fit parameter for all reflections included in the refinement | 1.052 |
Diffraction radiation probe | x-ray |
Diffraction radiation wavelength | 1.54184 Å |
Diffraction radiation type | CuKα |