Information card for entry 1571866
Original IUCr paper | HTML |
Chemical name | [1,1'-biphenyl]-2-yl)methanol (absorbed in crystalline sponge) |
Formula | C36 H24 I6 N12 Zn3 |
Calculated formula | C36 H24 I5.9984 N12 Zn2.9992 |
Title of publication | Statistical optimization of guest uptake in crystalline sponges: grading structural outcomes. |
Authors of publication | Carroll, Robert C.; Coles, Simon J. |
Journal of publication | IUCrJ |
Year of publication | 2024 |
Journal volume | 11 |
Journal issue | 4 |
a | 34.412 ± 0.002 Å |
b | 15.0303 ± 0.0005 Å |
c | 29.994 ± 0.003 Å |
α | 90° |
β | 100.858 ± 0.007° |
γ | 90° |
Cell volume | 15235.8 ± 1.9 Å3 |
Cell temperature | 100 ± 2 K |
Ambient diffraction temperature | 100 ± 2 K |
Number of distinct elements | 5 |
Space group number | 15 |
Hermann-Mauguin space group symbol | C 1 2/c 1 |
Hall space group symbol | -C 2yc |
Residual factor for all reflections | 0.1166 |
Residual factor for significantly intense reflections | 0.0899 |
Weighted residual factors for significantly intense reflections | 0.3042 |
Weighted residual factors for all reflections included in the refinement | 0.3336 |
Goodness-of-fit parameter for all reflections included in the refinement | 1.105 |
Diffraction radiation probe | x-ray |
Diffraction radiation wavelength | 1.54184 Å |
Diffraction radiation type | CuKα |