Information card for entry 1571868
Original IUCr paper | HTML |
Chemical name | (2',6'-dimethoxy-[1,1'-biphenyl]-2-yl)methanol (absorbed in crystalline sponge) |
Formula | C82.5 H59.2 I12 N24 O2.1 Zn6 |
Calculated formula | C82.5015 H59.2016 I12 N24 O2.1003 Zn6 |
Title of publication | Statistical optimization of guest uptake in crystalline sponges: grading structural outcomes. |
Authors of publication | Carroll, Robert C.; Coles, Simon J. |
Journal of publication | IUCrJ |
Year of publication | 2024 |
Journal volume | 11 |
Journal issue | 4 |
a | 31.6622 ± 0.0007 Å |
b | 15.0003 ± 0.0002 Å |
c | 34.4418 ± 0.0008 Å |
α | 90° |
β | 102.214 ± 0.002° |
γ | 90° |
Cell volume | 15987.6 ± 0.6 Å3 |
Cell temperature | 100 ± 2 K |
Ambient diffraction temperature | 100 ± 2 K |
Number of distinct elements | 6 |
Space group number | 13 |
Hermann-Mauguin space group symbol | P 1 2/n 1 |
Hall space group symbol | -P 2yac |
Residual factor for all reflections | 0.1587 |
Residual factor for significantly intense reflections | 0.1433 |
Weighted residual factors for significantly intense reflections | 0.4434 |
Weighted residual factors for all reflections included in the refinement | 0.4536 |
Goodness-of-fit parameter for all reflections included in the refinement | 1.039 |
Diffraction radiation probe | x-ray |
Diffraction radiation wavelength | 1.54184 Å |
Diffraction radiation type | CuKα |