Information card for entry 1571871
Original IUCr paper | HTML |
Chemical name | (2',6'-dimethoxy-[1,1'-biphenyl]-2-yl)methanol (absorbed in crystalline sponge) |
Formula | C85.35 H63.69 I12 N24 O2.36 Zn6 |
Calculated formula | C85.3548 H63.6916 I12 N24 O2.361 Zn6 |
Title of publication | Statistical optimization of guest uptake in crystalline sponges: grading structural outcomes. |
Authors of publication | Carroll, Robert C.; Coles, Simon J. |
Journal of publication | IUCrJ |
Year of publication | 2024 |
Journal volume | 11 |
Journal issue | 4 |
a | 31.479 ± 0.0008 Å |
b | 15.0233 ± 0.0003 Å |
c | 34.2503 ± 0.0006 Å |
α | 90° |
β | 101.732 ± 0.002° |
γ | 90° |
Cell volume | 15859.2 ± 0.6 Å3 |
Cell temperature | 100 ± 0.1 K |
Ambient diffraction temperature | 100 ± 0.1 K |
Number of distinct elements | 6 |
Space group number | 13 |
Hermann-Mauguin space group symbol | P 1 2/n 1 |
Hall space group symbol | -P 2yac |
Residual factor for all reflections | 0.1418 |
Residual factor for significantly intense reflections | 0.1149 |
Weighted residual factors for significantly intense reflections | 0.3535 |
Weighted residual factors for all reflections included in the refinement | 0.3774 |
Goodness-of-fit parameter for all reflections included in the refinement | 1.016 |
Diffraction radiation probe | x-ray |
Diffraction radiation wavelength | 1.54184 Å |
Diffraction radiation type | CuKα |