Information card for entry 1572166
Formula | C35 H45 Cl2 N O Ru |
Calculated formula | C35 H45 Cl2 N O Ru |
Title of publication | Streamlined synthetic assembly of α-chiral CAAC ligands and catalytic performance of their copper and ruthenium complexes. |
Authors of publication | Madron du Vigné, Adrien; Cramer, Nicolai |
Journal of publication | Chemical science |
Year of publication | 2024 |
Journal volume | 15 |
Journal issue | 34 |
Pages of publication | 13864 - 13871 |
a | 11.5043 ± 0.0003 Å |
b | 16.034 ± 0.0004 Å |
c | 17.8672 ± 0.0005 Å |
α | 90° |
β | 90° |
γ | 90° |
Cell volume | 3295.78 ± 0.15 Å3 |
Cell temperature | 139.99 ± 0.1 K |
Ambient diffraction temperature | 139.99 ± 0.1 K |
Number of distinct elements | 6 |
Space group number | 19 |
Hermann-Mauguin space group symbol | P 21 21 21 |
Hall space group symbol | P 2ac 2ab |
Residual factor for all reflections | 0.0659 |
Residual factor for significantly intense reflections | 0.055 |
Weighted residual factors for significantly intense reflections | 0.137 |
Weighted residual factors for all reflections included in the refinement | 0.1448 |
Goodness-of-fit parameter for all reflections included in the refinement | 1.065 |
Diffraction radiation probe | x-ray |
Diffraction radiation wavelength | 1.54184 Å |
Diffraction radiation type | CuKα |