Information card for entry 1572199
Formula | C26 H38 N Y |
Calculated formula | C26 H38 N Y |
Title of publication | Construction of intermolecular σ-hole interactions in rare earth metallocene complexes using a 2,3,4,5-tetraiodopyrrolyl anion. |
Authors of publication | Delano, 4th, Francis; Benner, Florian; Jang, Seoyun; Greer, Samuel M.; Demir, Selvan |
Journal of publication | Chemical science |
Year of publication | 2024 |
Journal volume | 15 |
Journal issue | 33 |
Pages of publication | 13389 - 13404 |
a | 9.3429 ± 0.00006 Å |
b | 15.24462 ± 0.00011 Å |
c | 16.36886 ± 0.00011 Å |
α | 90° |
β | 98.4832 ± 0.0006° |
γ | 90° |
Cell volume | 2305.89 ± 0.03 Å3 |
Cell temperature | 100 ± 0.1 K |
Ambient diffraction temperature | 100.15 K |
Number of distinct elements | 4 |
Space group number | 14 |
Hermann-Mauguin space group symbol | P 1 21/c 1 |
Hall space group symbol | -P 2ybc |
Residual factor for all reflections | 0.0276 |
Residual factor for significantly intense reflections | 0.0257 |
Weighted residual factors for significantly intense reflections | 0.0673 |
Weighted residual factors for all reflections included in the refinement | 0.0686 |
Goodness-of-fit parameter for all reflections included in the refinement | 1.0251 |
Diffraction radiation wavelength | 1.54184 Å |
Diffraction radiation type | CuKα |