Information card for entry 1572275
Formula | C86 H116 I N2 Yb |
Calculated formula | C86 H116 I N2 Yb |
Title of publication | δ-Bonding modulates the electronic structure of formally divalent nd<sup>1</sup> rare earth arene complexes. |
Authors of publication | MacKenzie, Ross E.; Hajdu, Tomáš; Seed, John A.; Whitehead, George F. S.; Adams, Ralph W.; Chilton, Nicholas F.; Collison, David; McInnes, Eric J. L.; Goodwin, Conrad A. P. |
Journal of publication | Chemical science |
Year of publication | 2024 |
Journal volume | 15 |
Journal issue | 37 |
Pages of publication | 15160 - 15169 |
a | 13.845 ± 0.0003 Å |
b | 15.1906 ± 0.0003 Å |
c | 19.2184 ± 0.0003 Å |
α | 90.204 ± 0.0015° |
β | 110.285 ± 0.0016° |
γ | 92.515 ± 0.0016° |
Cell volume | 3786.81 ± 0.13 Å3 |
Cell temperature | 100 ± 0.1 K |
Ambient diffraction temperature | 100 ± 0.1 K |
Number of distinct elements | 5 |
Space group number | 2 |
Hermann-Mauguin space group symbol | P -1 |
Hall space group symbol | -P 1 |
Residual factor for all reflections | 0.0418 |
Residual factor for significantly intense reflections | 0.0295 |
Weighted residual factors for significantly intense reflections | 0.0605 |
Weighted residual factors for all reflections included in the refinement | 0.0637 |
Goodness-of-fit parameter for all reflections included in the refinement | 1.019 |
Diffraction radiation probe | x-ray |
Diffraction radiation wavelength | 0.71073 Å |
Diffraction radiation type | MoKα |