Information card for entry 1572334
Formula | C42 H45 Br3 N6 |
Calculated formula | C42 H45 Br3 N6 |
Title of publication | Dynamic and solid-state behaviour of bromoisotrianglimine. |
Authors of publication | Scholes, Abbie M.; Kershaw Cook, Laurence J.; Szczypiński, Filip T; Luzyanin, Konstantin V.; Egleston, Benjamin D.; Greenaway, Rebecca L.; Slater, Anna G. |
Journal of publication | Chemical science |
Year of publication | 2024 |
Journal volume | 15 |
Journal issue | 35 |
Pages of publication | 14254 - 14263 |
a | 14.5723 ± 0.0003 Å |
b | 18.9659 ± 0.0003 Å |
c | 14.9238 ± 0.0002 Å |
α | 90° |
β | 91.908 ± 0.001° |
γ | 90° |
Cell volume | 4122.31 ± 0.12 Å3 |
Cell temperature | 100.01 ± 0.1 K |
Ambient diffraction temperature | 100.01 ± 0.1 K |
Number of distinct elements | 4 |
Space group number | 4 |
Hermann-Mauguin space group symbol | P 1 21 1 |
Hall space group symbol | P 2yb |
Residual factor for all reflections | 0.089 |
Residual factor for significantly intense reflections | 0.0755 |
Weighted residual factors for significantly intense reflections | 0.1757 |
Weighted residual factors for all reflections included in the refinement | 0.1829 |
Goodness-of-fit parameter for all reflections included in the refinement | 1.066 |
Diffraction radiation probe | x-ray |
Diffraction radiation wavelength | 0.71073 Å |
Diffraction radiation type | MoKα |