Information card for entry 1572354
Formula | C13 H8 F2 K N3 O Pt |
Calculated formula | C13 H6 F2 K N3 O Pt |
Title of publication | Thermo-responsive emission induced by different delocalized excited-states in isomorphous Pd(ii) and Pt(ii) one-dimensional chains. |
Authors of publication | Saito, Tomoya; Yoshida, Masaki; Segawa, Kaito; Saito, Daisuke; Takayama, Junichi; Hiura, Satoshi; Murayama, Akihiro; Lakshan, Nishshanka M.; Sameera, W. M. C.; Kobayashi, Atsushi; Kato, Masako |
Journal of publication | Chemical science |
Year of publication | 2024 |
Journal volume | 15 |
Journal issue | 35 |
Pages of publication | 14497 - 14505 |
a | 19.8126 ± 0.0014 Å |
b | 10.2058 ± 0.0008 Å |
c | 6.607 ± 0.0004 Å |
α | 90° |
β | 94.742 ± 0.007° |
γ | 90° |
Cell volume | 1331.39 ± 0.16 Å3 |
Cell temperature | 150 K |
Ambient diffraction temperature | 150 K |
Number of distinct elements | 7 |
Space group number | 14 |
Hermann-Mauguin space group symbol | P 1 21/c 1 |
Hall space group symbol | -P 2ybc |
Residual factor for all reflections | 0.099 |
Residual factor for significantly intense reflections | 0.0828 |
Weighted residual factors for significantly intense reflections | 0.229 |
Weighted residual factors for all reflections included in the refinement | 0.2385 |
Goodness-of-fit parameter for all reflections included in the refinement | 1.088 |
Diffraction radiation probe | x-ray |
Diffraction radiation wavelength | 1.54184 Å |
Diffraction radiation type | CuKα |