Information card for entry 1572383
Formula | C102 H239 Ag32 O34 P17 Pt2 S34 |
Calculated formula | C102 H239 Ag32 O34 P17 Pt2 S34 |
Title of publication | Controlled aggregation of Pt/PtH/Rh/RhH doped silver superatomic nanoclusters into 16-electron supermolecules. |
Authors of publication | Chiu, Tzu-Hao; Pillay, Michael N.; Wu, Ying-Yann; Niihori, Yoshiki; Negishi, Yuichi; Chen, Jie-Ying; Chen, Yuan Jang; Kahlal, Samia; Saillard, Jean-Yves; Liu, C. W. |
Journal of publication | Chemical science |
Year of publication | 2024 |
Journal volume | 15 |
Journal issue | 36 |
Pages of publication | 14660 - 14667 |
a | 19.4846 ± 0.0011 Å |
b | 20.7482 ± 0.0012 Å |
c | 30.0519 ± 0.0017 Å |
α | 98.0114 ± 0.0014° |
β | 102.16 ± 0.0014° |
γ | 116.039 ± 0.0013° |
Cell volume | 10292.6 ± 1 Å3 |
Cell temperature | 100 ± 2 K |
Ambient diffraction temperature | 100 ± 2 K |
Number of distinct elements | 7 |
Space group number | 2 |
Hermann-Mauguin space group symbol | P -1 |
Hall space group symbol | -P 1 |
Residual factor for all reflections | 0.0802 |
Residual factor for significantly intense reflections | 0.0555 |
Weighted residual factors for significantly intense reflections | 0.1333 |
Weighted residual factors for all reflections included in the refinement | 0.1511 |
Goodness-of-fit parameter for all reflections included in the refinement | 1.032 |
Diffraction radiation wavelength | 0.71073 Å |
Diffraction radiation type | MoKα |