Information card for entry 1572395
Original IUCr paper | HTML |
Formula | C25 H24 Au O P |
Calculated formula | C25 H24 Au O P |
Title of publication | Structure-property relationship of a complex photoluminescent arylacetylide-gold(I) compound. I: a pressure-induced phase transformation caught in the act. |
Authors of publication | Jastrzębska, Róża; Poręba, Tomasz; Cova, Federico; Tchoń, Daniel M; Makal, Anna |
Journal of publication | IUCrJ |
Year of publication | 2024 |
Journal volume | 11 |
Journal issue | 5 |
a | 16.0839 ± 0.0005 Å |
b | 14.224 ± 0.0007 Å |
c | 10.1393 ± 0.0003 Å |
α | 109.816 ± 0.004° |
β | 98.398 ± 0.002° |
γ | 85.874 ± 0.003° |
Cell volume | 2158.26 ± 0.15 Å3 |
Cell temperature | 293 ± 2 K |
Ambient diffraction temperature | 293 ± 2 K |
Number of distinct elements | 5 |
Space group number | 2 |
Hermann-Mauguin space group symbol | P -1 |
Hall space group symbol | -P 1 |
Residual factor for all reflections | 0.07 |
Residual factor for significantly intense reflections | 0.0396 |
Weighted residual factors for significantly intense reflections | 0.0713 |
Weighted residual factors for all reflections included in the refinement | 0.0816 |
Goodness-of-fit parameter for all reflections included in the refinement | 1.029 |
Diffraction radiation wavelength | 0.71073 Å |
Diffraction radiation type | MoKα |