Information card for entry 1572410
Formula | C54 H36 Cl10 Ga3 |
Calculated formula | C54 H36 Cl10 Ga3 |
Title of publication | A unique trimeric triphenylene radical cation: stacking aggregation, bonding, and stability. |
Authors of publication | Bhattacharjee, Rameswar; McCormack, Megan E.; Zhou, Zheng; Wei, Zheng; Petrukhina, Marina A.; Kertesz, Miklos |
Journal of publication | Chemical science |
Year of publication | 2024 |
Journal volume | 15 |
Journal issue | 37 |
Pages of publication | 15221 - 15231 |
a | 12.5889 ± 0.0011 Å |
b | 15.8207 ± 0.0013 Å |
c | 12.628 ± 0.0011 Å |
α | 90° |
β | 94.562 ± 0.002° |
γ | 90° |
Cell volume | 2507.1 ± 0.4 Å3 |
Cell temperature | 100 ± 2 K |
Ambient diffraction temperature | 100 ± 2 K |
Number of distinct elements | 4 |
Space group number | 4 |
Hermann-Mauguin space group symbol | P 1 21 1 |
Hall space group symbol | P 2yb |
Residual factor for all reflections | 0.0407 |
Residual factor for significantly intense reflections | 0.0315 |
Weighted residual factors for significantly intense reflections | 0.0641 |
Weighted residual factors for all reflections included in the refinement | 0.0674 |
Goodness-of-fit parameter for all reflections included in the refinement | 1.034 |
Diffraction radiation wavelength | 0.71073 Å |
Diffraction radiation type | MoKα |