Information card for entry 1572471
Formula | C52 H67 Ga N2 O |
Calculated formula | C52 H67 Ga N2 O |
Title of publication | On the nature and limits of alkaline earth-triel bonding. |
Authors of publication | Boronski, Josef T.; Griffin, Liam P.; Conder, Caroline; Crumpton, Agamemnon E.; Wales, Lewis L.; Aldridge, Simon |
Journal of publication | Chemical science |
Year of publication | 2024 |
Journal volume | 15 |
Journal issue | 37 |
Pages of publication | 15377 - 15384 |
a | 19.3033 ± 0.0002 Å |
b | 17.3028 ± 0.0002 Å |
c | 27.4999 ± 0.0004 Å |
α | 90° |
β | 103.204 ± 0.0012° |
γ | 90° |
Cell volume | 8942.2 ± 0.2 Å3 |
Cell temperature | 100 ± 0.1 K |
Ambient diffraction temperature | 100 ± 0.1 K |
Number of distinct elements | 5 |
Space group number | 15 |
Hermann-Mauguin space group symbol | C 1 2/c 1 |
Hall space group symbol | -C 2yc |
Residual factor for all reflections | 0.0697 |
Residual factor for significantly intense reflections | 0.0607 |
Weighted residual factors for significantly intense reflections | 0.1618 |
Weighted residual factors for all reflections included in the refinement | 0.1667 |
Goodness-of-fit parameter for all reflections included in the refinement | 1.163 |
Diffraction radiation probe | x-ray |
Diffraction radiation wavelength | 0.71073 Å |
Diffraction radiation type | MoKα |