Information card for entry 1573018
Formula | C17 H14 N P |
Calculated formula | C17 H14 N P |
Title of publication | Optical activity levels of metal centers controlling multi-mode emissions in low-dimensional hybrid metal halides for anti-counterfeiting and information encryption. |
Authors of publication | Ren, Qiqiong; Zhou, Guojun; Mao, Yilin; Zhang, Nan; Zhang, Jian; Zhang, Xian-Ming |
Journal of publication | Chemical science |
Year of publication | 2024 |
Journal volume | 15 |
Journal issue | 40 |
Pages of publication | 16536 - 16545 |
a | 9.9066 ± 0.0002 Å |
b | 9.8822 ± 0.0002 Å |
c | 14.8879 ± 0.0002 Å |
α | 90° |
β | 92.988 ± 0.001° |
γ | 90° |
Cell volume | 1455.53 ± 0.05 Å3 |
Cell temperature | 298 K |
Ambient diffraction temperature | 298 K |
Number of distinct elements | 4 |
Space group number | 14 |
Hermann-Mauguin space group symbol | P 1 21/n 1 |
Hall space group symbol | -P 2yn |
Residual factor for all reflections | 0.0445 |
Residual factor for significantly intense reflections | 0.0379 |
Weighted residual factors for significantly intense reflections | 0.0979 |
Weighted residual factors for all reflections included in the refinement | 0.1014 |
Goodness-of-fit parameter for all reflections included in the refinement | 1.047 |
Diffraction radiation probe | x-ray |
Diffraction radiation wavelength | 1.54184 Å |
Diffraction radiation type | CuKα |