Information card for entry 2008276
Formula |
C44 H2 F28 N4 |
Calculated formula |
C44 H2 F28 N4 |
Title of publication |
2,3,7,8,12,13,17,18-Octafluoro-5,10,15,20-tetrakis(pentafluorophenyl)porphyrin |
Authors of publication |
Leroy, Jacques; Bondon, Arnaud; Toupet, Loic |
Journal of publication |
Acta Crystallographica Section C |
Year of publication |
1999 |
Journal volume |
55 |
Journal issue |
3 |
Pages of publication |
464 - 466 |
a |
6.1818 ± 0.001 Å |
b |
13.008 ± 0.003 Å |
c |
13.605 ± 0.009 Å |
α |
105 ± 0.03° |
β |
92.46 ± 0.03° |
γ |
101.74 ± 0.02° |
Cell volume |
1029.3 ± 0.8 Å3 |
Cell temperature |
293 ± 2 K |
Ambient diffraction temperature |
293 ± 2 K |
Number of distinct elements |
4 |
Space group number |
2 |
Hermann-Mauguin space group symbol |
P -1 |
Hall space group symbol |
-P 1 |
Residual factor for all reflections |
0.083 |
Residual factor for significantly intense reflections |
0.0421 |
Weighted residual factors for all reflections included in the refinement |
0.1267 |
Goodness-of-fit parameter for all reflections included in the refinement |
1.024 |
Diffraction radiation wavelength |
0.71073 Å |
Diffraction radiation type |
MoKα |
Yes |
Yes |
No |