Information card for entry 2008392
Original IUCr paper | HTML |
Chemical name | catena-Poly[bis(2-thiopheneglyoxylato-O^1^,O^2^)copper(II) -μ-(2-thiopheneglyoxylato-O^1^:O^1^,O^2^)-bis(3-methylpyridine)copper(II) -μ-(2-thiopheneglyoxylato-O^1^,O^2^:O^1^)monohydrate |
Formula | C36 H28 Cu2 N2 O13 S4 |
Calculated formula | C37.666 H27 Cu2 N2 O13 S3.376 |
Title of publication | Copper(II) 2-thiopheneglyoxylate adducts with pyridine derivatives |
Authors of publication | Nakasa, Kazuyuki; Nakagawa, Hiroo; Kani, Yoshiyuki; Tsuchimoto, Masanobu; Ohba, Shigeru |
Journal of publication | Acta Crystallographica Section C |
Year of publication | 1999 |
Journal volume | 55 |
Journal issue | 4 |
Pages of publication | 513 - 517 |
a | 20.16 ± 0.003 Å |
b | 9 ± 0.002 Å |
c | 24.497 ± 0.003 Å |
α | 90° |
β | 118.47 ± 0.01° |
γ | 90° |
Cell volume | 3907.2 ± 1.2 Å3 |
Cell temperature | 298 K |
Number of distinct elements | 6 |
Space group number | 15 |
Hermann-Mauguin space group symbol | C 1 2/c 1 |
Hall space group symbol | -C 2yc |
Residual factor for significantly intense reflections | 0.052 |
Weighted residual factors for significantly intense reflections | 0.05 |
Goodness-of-fit parameter for significantly intense reflections | 1.643 |
Diffraction radiation wavelength | 0.71073 Å |
Diffraction radiation type | MoKα |