Information card for entry 2014273
Structure factors | 2014273.hkl |
Original IUCr paper | HTML |
Formula | C18 H20 Cl2 Fe N8 O2 |
Calculated formula | C18 H20 Cl2 Fe N8 O2 |
SMILES | [Fe]12(Cl)(Cl)(n3c([n](C)cc3)C(=O)c3n1cc[n]3C)n1c([n](C)cc1)C(=O)c1n2cc[n]1C |
Title of publication | Tris[bis(1-methyl-1<i>H</i>-imidazol-2-yl)methanone-κ^2^<i>N</i>^3^]iron(II) dichloride 5.5-hydrate, <i>cis</i>-bis[bis(1-methyl-1<i>H</i>-imidazol-2-yl)methanone-κ^2^<i>N</i>^3^]dichloroiron(II) (<i>ca</i> 153 K) and di-μ-chloro-bis{[bis(1-methyl-1<i>H</i>-imidazol-2-yl)methanone-κ^2^<i>N</i>^3^]chloroiron(II)} methanol disolvate (<i>ca</i> 300 K) |
Authors of publication | Batten, Michael P.; Canty, Allan J.; Cavell, Kingsley J.; Rüther, Thomas; Skelton, Brian W.; White, Allan H. |
Journal of publication | Acta Crystallographica Section C |
Year of publication | 2004 |
Journal volume | 60 |
Journal issue | 7 |
Pages of publication | m316 - m319 |
a | 14.65 ± 0.002 Å |
b | 9.134 ± 0.001 Å |
c | 16.18 ± 0.002 Å |
α | 90° |
β | 102.078 ± 0.003° |
γ | 90° |
Cell volume | 2117.2 ± 0.5 Å3 |
Cell temperature | 153 ± 2 K |
Ambient diffraction temperature | 153 ± 2 K |
Number of distinct elements | 6 |
Space group number | 14 |
Hermann-Mauguin space group symbol | P 1 21/c 1 |
Hall space group symbol | -P 2ybc |
Residual factor for all reflections | 0.066 |
Residual factor for significantly intense reflections | 0.044 |
Weighted residual factors for all reflections | 0.096 |
Weighted residual factors for all reflections included in the refinement | 0.082 |
Goodness-of-fit parameter for all reflections | 1.047 |
Goodness-of-fit parameter for all reflections included in the refinement | 1.039 |
Diffraction radiation wavelength | 0.71073 Å |
Diffraction radiation type | MoKα |