Information card for entry 2014275
Structure factors | 2014275.hkl |
Original IUCr paper | HTML |
Formula | C27 H41 Cl2 Fe N12 O8.5 |
Calculated formula | C27 H41 Cl2 Fe N12 O8.5 |
Title of publication | Tris[bis(1-methyl-1<i>H</i>-imidazol-2-yl)methanone-κ^2^<i>N</i>^3^]iron(II) dichloride 5.5-hydrate, <i>cis</i>-bis[bis(1-methyl-1<i>H</i>-imidazol-2-yl)methanone-κ^2^<i>N</i>^3^]dichloroiron(II) (<i>ca</i> 153 K) and di-μ-chloro-bis{[bis(1-methyl-1<i>H</i>-imidazol-2-yl)methanone-κ^2^<i>N</i>^3^]chloroiron(II)} methanol disolvate (<i>ca</i> 300 K) |
Authors of publication | Batten, Michael P.; Canty, Allan J.; Cavell, Kingsley J.; Rüther, Thomas; Skelton, Brian W.; White, Allan H. |
Journal of publication | Acta Crystallographica Section C |
Year of publication | 2004 |
Journal volume | 60 |
Journal issue | 7 |
Pages of publication | m316 - m319 |
a | 21.3036 ± 0.001 Å |
b | 13.9936 ± 0.0007 Å |
c | 24.4634 ± 0.001 Å |
α | 90° |
β | 104.23 ± 0.001° |
γ | 90° |
Cell volume | 7069.1 ± 0.6 Å3 |
Cell temperature | 153 ± 2 K |
Ambient diffraction temperature | 153 ± 2 K |
Number of distinct elements | 6 |
Space group number | 15 |
Hermann-Mauguin space group symbol | C 1 2/c 1 |
Hall space group symbol | -C 2yc |
Residual factor for all reflections | 0.095 |
Residual factor for significantly intense reflections | 0.062 |
Weighted residual factors for all reflections | 0.138 |
Weighted residual factors for all reflections included in the refinement | 0.13 |
Goodness-of-fit parameter for all reflections | 1.384 |
Goodness-of-fit parameter for all reflections included in the refinement | 1.22 |
Diffraction radiation wavelength | 0.71073 Å |
Diffraction radiation type | MoKα |