Information card for entry 2014375
Structure factors | 2014375.hkl |
Original IUCr paper | HTML |
Chemical name | catena-poly[[[bis(ethylenediamine)platinum(II)]-μ-iodo- [bis(ethylenediamine)platinum(IV)]-μ-iodo] hydrogenphosphate dihydrogenphosphate iodide trihydrate] |
Formula | C8 H41 I3 N8 O11 P2 Pt2 |
Calculated formula | C8 H41 I3 N8 O11 P2 Pt2 |
SMILES | I[Pt]12([NH2]CC[NH2]1)([NH2]CC[NH2]2)I.[I-].P(=O)([O-])([O-])O.P(=O)([O-])(O)O.C1C[NH2][Pt]2([NH2]1)[NH2]CC[NH2]2.O.O.O |
Title of publication | A one-dimensional iodine-bridged Pt^II^/Pt^IV^ mixed-valence complex, <i>catena</i>-poly[[[bis(ethylenediamine)platinum(II)]-μ-iodo-[bis(ethylenediamine)platinum(IV)]-μ-iodo] hydrogenphosphate dihydrogenphosphate iodide trihydrate] |
Authors of publication | Matsushita, Nobuyuki |
Journal of publication | Acta Crystallographica Section C |
Year of publication | 2006 |
Journal volume | 62 |
Journal issue | 2 |
Pages of publication | m33 - m36 |
a | 14.808 ± 0.001 Å |
b | 16.478 ± 0.002 Å |
c | 11.758 ± 0.001 Å |
α | 90° |
β | 90.84 ± 0.01° |
γ | 90° |
Cell volume | 2868.7 ± 0.5 Å3 |
Cell temperature | 295 K |
Ambient diffraction temperature | 295 K |
Number of distinct elements | 7 |
Space group number | 14 |
Hermann-Mauguin space group symbol | P 1 21/n 1 |
Hall space group symbol | -P 2yn |
Residual factor for significantly intense reflections | 0.0325 |
Weighted residual factors for significantly intense reflections | 0.083 |
Weighted residual factors for all reflections included in the refinement | 0.0836 |
Goodness-of-fit parameter for all reflections included in the refinement | 1.104 |
Diffraction radiation wavelength | 0.71069 Å |
Diffraction radiation type | MoKα |