Information card for entry 2014422
Common name |
zafirlukast ethanol solvate |
Chemical name |
4-(5-cyclopentyloxycarbonylamino-1-methylindol- 3-ylmethyl)-3-methoxy-N-(o-tolylsulfonyl)benzamide ethanol solvate |
Formula |
C33 H39 N3 O7 S |
Calculated formula |
C33 H39 N3 O7 S |
SMILES |
S(=O)(=O)(NC(=O)c1cc(OC)c(Cc2c3cc(NC(=O)OC4CCCC4)ccc3n(c2)C)cc1)c1ccccc1C.OCC |
Title of publication |
Solvates of zafirlukast |
Authors of publication |
Goldring, Dmitry; Botoshansky, Mark; Khalfin, Rafail L.; Pertsikov, Boris; Nisnevitch, Gennady; Ponomarev, Victor; Zaltzman, Igor; Gutman, Arie; Kaftory, Menahem |
Journal of publication |
Acta Crystallographica Section C |
Year of publication |
2004 |
Journal volume |
60 |
Journal issue |
12 |
Pages of publication |
o843 - o846 |
a |
17.216 ± 0.003 Å |
b |
11.033 ± 0.002 Å |
c |
18.258 ± 0.004 Å |
α |
90° |
β |
109.47 ± 0.03° |
γ |
90° |
Cell volume |
3269.7 ± 1.2 Å3 |
Cell temperature |
293 ± 2 K |
Ambient diffraction temperature |
293 ± 2 K |
Number of distinct elements |
5 |
Space group number |
9 |
Hermann-Mauguin space group symbol |
C 1 c 1 |
Hall space group symbol |
C -2yc |
Residual factor for all reflections |
0.1523 |
Residual factor for significantly intense reflections |
0.0498 |
Weighted residual factors for significantly intense reflections |
0.0962 |
Weighted residual factors for all reflections included in the refinement |
0.1144 |
Goodness-of-fit parameter for all reflections included in the refinement |
0.808 |
Diffraction radiation wavelength |
0.7107 Å |
Diffraction radiation type |
MoKα |
Yes |
No |
Yes |