Information card for entry 2015312
Original IUCr paper | HTML |
Chemical name | N-(2-Methoxy-6-oxopyrimidin-4-yl)formamide |
Formula | C6 H7 N3 O3 |
Calculated formula | C6 H7 N3 O3 |
Title of publication | <i>N</i>-(2-Methoxy-6-oxo-1,6-dihydropyrimidin-4-yl)formamide: hydrogen-bonded sheets of centrosymmetric <i>R</i>~2~^2^(8) and <i>R</i>~6~^4^(28) rings |
Authors of publication | Torre, José M. de la; Nogueras, Manuel; Cobo, Justo; Low, John N.; Glidewell, Christopher |
Journal of publication | Acta Crystallographica Section C |
Year of publication | 2006 |
Journal volume | 62 |
Journal issue | 5 |
Pages of publication | o256 - o258 |
a | 7.0515 ± 0.0007 Å |
b | 9.0031 ± 0.0012 Å |
c | 11.237 ± 0.002 Å |
α | 90° |
β | 93.69 ± 0.011° |
γ | 90° |
Cell volume | 711.91 ± 0.17 Å3 |
Cell temperature | 120 ± 2 K |
Ambient diffraction temperature | 120 ± 2 K |
Number of distinct elements | 4 |
Space group number | 14 |
Hermann-Mauguin space group symbol | P 1 21/n 1 |
Hall space group symbol | -P 2yn |
Residual factor for all reflections | 0.1286 |
Residual factor for significantly intense reflections | 0.0511 |
Weighted residual factors for significantly intense reflections | 0.11 |
Weighted residual factors for all reflections included in the refinement | 0.1465 |
Goodness-of-fit parameter for all reflections included in the refinement | 1.105 |
Diffraction radiation wavelength | 0.71073 Å |
Diffraction radiation type | MoKα |