Information card for entry 2018443
Structure factors | 2018443.hkl |
Original IUCr paper | HTML |
Chemical name | <i>cis</i>-(2<i>RS</i>,4<i>SR</i>)-2-(thiophen-2-yl)-2,3,4,5-tetrahydro- 1<i>H</i>-1-benzazepin-4-ol |
Formula | C14 H15 N O S |
Calculated formula | C14 H15 N O S |
Title of publication | Chain formation by disordered, but correlated, hydrogen bonds in <i>cis</i>-(2<i>RS</i>,4<i>SR</i>)-2-(thiophen-2-yl)-2,3,4,5-tetrahydro-1<i>H</i>-1-benzazepin-4-ol and <i>cis</i>-(2<i>RS</i>,4<i>SR</i>)-2-(5-methylthiophen-2-yl)-2,3,4,5-tetrahydro-1<i>H</i>-1-benzazepin-4-ol |
Authors of publication | Blanco, Maria Camila; Palma, Alirio; Cobo, Justo; Glidewell, Christopher |
Journal of publication | Acta Crystallographica Section C |
Year of publication | 2012 |
Journal volume | 68 |
Journal issue | 3 |
Pages of publication | o126 - o130 |
a | 9.5677 ± 0.0006 Å |
b | 9.8798 ± 0.0004 Å |
c | 14.7183 ± 0.0011 Å |
α | 104.726 ± 0.005° |
β | 104.033 ± 0.006° |
γ | 103.273 ± 0.004° |
Cell volume | 1240.95 ± 0.15 Å3 |
Cell temperature | 120 ± 2 K |
Ambient diffraction temperature | 120 ± 2 K |
Number of distinct elements | 5 |
Space group number | 2 |
Hermann-Mauguin space group symbol | P -1 |
Hall space group symbol | -P 1 |
Residual factor for all reflections | 0.0753 |
Residual factor for significantly intense reflections | 0.0469 |
Weighted residual factors for significantly intense reflections | 0.096 |
Weighted residual factors for all reflections included in the refinement | 0.108 |
Goodness-of-fit parameter for all reflections included in the refinement | 1.059 |
Diffraction radiation wavelength | 0.71073 Å |
Diffraction radiation type | MoKα |