Information card for entry 2019802
Chemical name
Poly[[(μ~4~-benzene-1,4-dicarboxylato)bis(μ~3~-benzene-1,4-dicarboxylato)bis(μ~3~-hydroxido)bis(1,10-phenanthroline-5,6-dione)tetrazinc] dihydrate]
Formula
C24 H15 N2 O10 Zn2
Calculated formula
C24 H13 N2 O10 Zn2
Title of publication
A three-dimensional coordination polymer based on the Zn~4~(μ~3~-OH)~2~ unit: poly[[(μ~4~-benzene-1,4-dicarboxylato)bis(μ~3~-benzene-1,4-dicarboxylato)bis(μ~3~-hydroxido)bis(1,10-phenanthroline-5,6-dione)tetrazinc] dihydrate]
Authors of publication
Wen, Meng; Xiao, Zu-Ping; Wang, Chun-Ya; Huang, Xi-He
Journal of publication
Acta Crystallographica Section C
Year of publication
2015
Journal volume
71
Journal issue
2
a
13.87 ± 0.003 Å
b
19.023 ± 0.004 Å
c
19.238 ± 0.004 Å
α
90°
β
90°
γ
90°
Cell volume
5075.9 ± 1.9 Å3
Cell temperature
293 ± 2 K
Ambient diffraction temperature
293 ± 2 K
Number of distinct elements
5
Space group number
61
Hermann-Mauguin space group symbol
P b c a
Hall space group symbol
-P 2ac 2ab
Residual factor for all reflections
0.064
Residual factor for significantly intense reflections
0.0595
Weighted residual factors for significantly intense reflections
0.1092
Weighted residual factors for all reflections included in the refinement
0.1112
Goodness-of-fit parameter for all reflections included in the refinement
1.152
Diffraction radiation wavelength
0.71073 Å
Diffraction radiation type
MoKα
Yes
No
Yes