Information card for entry 2023086
Original IUCr paper | HTML |
Chemical name | Tribromido(4-methylpiperidine)gold(III) |
Formula | C6 H13 Au Br3 N |
Calculated formula | C6 H13 Au Br3 N |
Title of publication | Crystal structures of trichlorido(4-methylpiperidine)gold(III) and two polymorphs of tribromido(4-methylpiperidine)gold(III) |
Authors of publication | Döring, Cindy; Jones, Peter G. |
Journal of publication | Acta Crystallographica Section E Crystallographic Communications |
Year of publication | 2024 |
Journal volume | 80 |
Journal issue | 5 |
a | 9.9871 ± 0.0005 Å |
b | 7.1505 ± 0.0004 Å |
c | 15.716 ± 0.0008 Å |
α | 90° |
β | 90° |
γ | 90° |
Cell volume | 1122.32 ± 0.1 Å3 |
Cell temperature | 100 ± 2 K |
Ambient diffraction temperature | 100 ± 2 K |
Number of distinct elements | 5 |
Space group number | 62 |
Hermann-Mauguin space group symbol | P n m a |
Hall space group symbol | -P 2ac 2n |
Residual factor for all reflections | 0.0422 |
Residual factor for significantly intense reflections | 0.0295 |
Weighted residual factors for significantly intense reflections | 0.0472 |
Weighted residual factors for all reflections included in the refinement | 0.0504 |
Goodness-of-fit parameter for all reflections included in the refinement | 1.11 |
Diffraction radiation wavelength | 0.71073 Å |
Diffraction radiation type | MoKα |