Information card for entry 2023136
Original IUCr paper | HTML |
Chemical name | Chlorido[4-methoxy-5-(2-oxo-2-propoxyethoxy)-2-(prop-2-en-1-yl)phenyl]\ (quinoline)platinum(II) |
Formula | C24 H26 Cl N O4 Pt |
Calculated formula | C24 H26 Cl N O4 Pt |
Title of publication | Synthesis and crystal structures of three organoplatinum(II) complexes bearing natural arylolefin and quinoline derivatives |
Authors of publication | Chi, Nguyen Thi Thanh; Van Thong, Pham; Thang, Nguyen Manh; Thao, Pham Ngoc; Van Meervelt, Luc |
Journal of publication | Acta Crystallographica Section E Crystallographic Communications |
Year of publication | 2024 |
Journal volume | 80 |
Journal issue | 6 |
a | 14.576 ± 0.002 Å |
b | 11.0945 ± 0.0009 Å |
c | 15.7 ± 0.002 Å |
α | 90° |
β | 117.197 ± 0.018° |
γ | 90° |
Cell volume | 2258.2 ± 0.6 Å3 |
Cell temperature | 114 ± 7 K |
Ambient diffraction temperature | 114 ± 7 K |
Number of distinct elements | 6 |
Space group number | 14 |
Hermann-Mauguin space group symbol | P 1 21/c 1 |
Hall space group symbol | -P 2ybc |
Residual factor for all reflections | 0.0395 |
Residual factor for significantly intense reflections | 0.0296 |
Weighted residual factors for significantly intense reflections | 0.0515 |
Weighted residual factors for all reflections included in the refinement | 0.0556 |
Goodness-of-fit parameter for all reflections included in the refinement | 1.039 |
Diffraction radiation wavelength | 0.71073 Å |
Diffraction radiation type | MoKα |