Information card for entry 2023215
Original IUCr paper | HTML |
Chemical name | Trichlorido(2-methylpyridine-κ<i>N</i>)gold(III) |
Formula | C6 H7 Au Cl3 N |
Calculated formula | C6 H7 Au Cl3 N |
Title of publication | Crystal structures of seven gold(III) complexes of the form LAuX 3 (L = substituted pyridine, X = Cl or Br) |
Authors of publication | Döring, Cindy; Jones, Peter G. |
Journal of publication | Acta Crystallographica Section E Crystallographic Communications |
Year of publication | 2024 |
Journal volume | 80 |
Journal issue | 8 |
Pages of publication | 894 - 909 |
a | 7.8077 ± 0.0008 Å |
b | 16.4881 ± 0.0015 Å |
c | 7.6929 ± 0.0009 Å |
α | 90° |
β | 103.92 ± 0.012° |
γ | 90° |
Cell volume | 961.26 ± 0.18 Å3 |
Cell temperature | 100 ± 2 K |
Ambient diffraction temperature | 100 ± 2 K |
Number of distinct elements | 5 |
Space group number | 14 |
Hermann-Mauguin space group symbol | P 1 21/c 1 |
Hall space group symbol | -P 2ybc |
Residual factor for all reflections | 0.0349 |
Residual factor for significantly intense reflections | 0.0251 |
Weighted residual factors for significantly intense reflections | 0.0485 |
Weighted residual factors for all reflections included in the refinement | 0.0498 |
Goodness-of-fit parameter for all reflections included in the refinement | 0.999 |
Diffraction radiation wavelength | 0.71073 Å |
Diffraction radiation type | MoKα |