Information card for entry 2023235
Original IUCr paper | HTML |
Chemical name | Bis[aqua(2,2'-bipyridine)fluoridotin(II)] hexafluoridotin(IV) |
Formula | C20 H20 F8 N4 O2 Sn3 |
Calculated formula | C20 H20 F8 N4 O2 Sn3 |
Title of publication | [SnF(bipy)(H2O)]2[SnF6], a mixed-valent inorganic tin(II)–tin(IV) compound |
Authors of publication | Röwekamp-Krugley, Natalia; Reuter, Hans |
Journal of publication | Acta Crystallographica Section E Crystallographic Communications |
Year of publication | 2024 |
Journal volume | 80 |
Journal issue | 9 |
a | 7.4579 ± 0.0004 Å |
b | 8.4601 ± 0.0005 Å |
c | 9.8864 ± 0.0006 Å |
α | 97.073 ± 0.002° |
β | 98.474 ± 0.002° |
γ | 100.644 ± 0.002° |
Cell volume | 599.06 ± 0.06 Å3 |
Cell temperature | 100 ± 2 K |
Ambient diffraction temperature | 100 ± 2 K |
Number of distinct elements | 6 |
Space group number | 2 |
Hermann-Mauguin space group symbol | P -1 |
Hall space group symbol | -P 1 |
Residual factor for all reflections | 0.0262 |
Residual factor for significantly intense reflections | 0.0223 |
Weighted residual factors for significantly intense reflections | 0.0517 |
Weighted residual factors for all reflections included in the refinement | 0.0533 |
Goodness-of-fit parameter for all reflections included in the refinement | 1.051 |
Diffraction radiation wavelength | 0.71073 Å |
Diffraction radiation type | MoKα |