Information card for entry 2023264
Original IUCr paper | HTML |
Common name | Bis(triisopropylphosphane sulfide)gold(I) tetrachloridoaurate(III) |
Chemical name | Bis[tris(propan-2-yl)-λ^5^-phosphanethione-κ<i>S</i>]gold(I) tetrachloridoaurate(III) |
Formula | C18 H42 Au2 Cl4 P2 S2 |
Calculated formula | C18 H42 Au2 Cl4 P2 S2 |
Title of publication | Crystal structures of seven mixed-valence gold compounds of the form [(R 1 R 2 R 3PE)2AuI]+[AuIII X 4]− (R = tert-butyl or isopropyl, E = S or Se, and X = Cl or Br) |
Authors of publication | Upmann, Daniel; Bockfeld, Dirk; Jones, Peter G.; Târcoveanu, Eliza |
Journal of publication | Acta Crystallographica Section E Crystallographic Communications |
Year of publication | 2024 |
Journal volume | 80 |
Journal issue | 10 |
Pages of publication | 1087 - 1096 |
a | 14.2552 ± 0.0004 Å |
b | 9.0574 ± 0.0002 Å |
c | 23.0043 ± 0.0007 Å |
α | 90° |
β | 96.703 ± 0.003° |
γ | 90° |
Cell volume | 2949.9 ± 0.14 Å3 |
Cell temperature | 100 ± 2 K |
Ambient diffraction temperature | 100 ± 2 K |
Number of distinct elements | 6 |
Space group number | 13 |
Hermann-Mauguin space group symbol | P 1 2/n 1 |
Hall space group symbol | -P 2yac |
Residual factor for all reflections | 0.0463 |
Residual factor for significantly intense reflections | 0.0282 |
Weighted residual factors for significantly intense reflections | 0.0449 |
Weighted residual factors for all reflections included in the refinement | 0.0491 |
Goodness-of-fit parameter for all reflections included in the refinement | 1.047 |
Diffraction radiation wavelength | 0.71073 Å |
Diffraction radiation type | MoKα |