Information card for entry 2023305
Original IUCr paper | HTML |
Chemical name | Pentakis(2-aminopyridinium) nonavanado(V)tellurate(VI) |
Formula | C25 H35 N10 O28 Te V9 |
Calculated formula | C25 H35 N10 O28 Te V9 |
Title of publication | Synthesis and structure of pentakis(2-aminopyridinium) nonavanado(V)tellurate(VI) |
Authors of publication | Mrad, Houda; Maalaoui, Ahlem; Rzaigui, Mohamed; Akriche, Samah |
Journal of publication | Acta Crystallographica Section E Crystallographic Communications |
Year of publication | 2024 |
Journal volume | 80 |
Journal issue | 12 |
a | 11.661 ± 0.002 Å |
b | 23.251 ± 0.002 Å |
c | 19.602 ± 0.003 Å |
α | 90° |
β | 122.53 ± 0.01° |
γ | 90° |
Cell volume | 4480.9 ± 1.2 Å3 |
Cell temperature | 293 ± 2 K |
Ambient diffraction temperature | 293 ± 2 K |
Number of distinct elements | 6 |
Space group number | 14 |
Hermann-Mauguin space group symbol | P 1 21/c 1 |
Hall space group symbol | -P 2ybc |
Residual factor for all reflections | 0.1818 |
Residual factor for significantly intense reflections | 0.076 |
Weighted residual factors for significantly intense reflections | 0.1718 |
Weighted residual factors for all reflections included in the refinement | 0.2112 |
Goodness-of-fit parameter for all reflections included in the refinement | 1.033 |
Diffraction radiation probe | x-ray |
Diffraction radiation wavelength | 0.56087 Å |
Diffraction radiation type | AgKα |