Information card for entry 2100398
Original IUCr paper | HTML |
Formula | C48 H108 O20 P4 Re4 Th |
Calculated formula | C48 H112 O20 P4 Re4 Th |
Title of publication | Temperature-resolved study of three [<i>M</i>(<i>M</i>'O~4~)~4~(TBPO)~4~] complexes (<i>MM</i>' = URe, ThRe, ThTc) |
Authors of publication | M. Helliwell; D. Collison; G. H. John; I. May; M. J. Sarsfield; C. A. Sharrad; A. D. Sutton |
Journal of publication | Acta Crystallographica Section B |
Year of publication | 2006 |
Journal volume | 62 |
Journal issue | 1 |
Pages of publication | 68 - 85 |
a | 15.5577 ± 0.0012 Å |
b | 15.5577 ± 0.0012 Å |
c | 14.873 ± 0.0017 Å |
α | 90° |
β | 90° |
γ | 90° |
Cell volume | 3599.9 ± 0.6 Å3 |
Cell temperature | 293 ± 2 K |
Ambient diffraction temperature | 293 ± 2 K |
Number of distinct elements | 6 |
Space group number | 121 |
Hermann-Mauguin space group symbol | I -4 2 m |
Hall space group symbol | I -4 2 |
Residual factor for all reflections | 0.0547 |
Residual factor for significantly intense reflections | 0.0442 |
Weighted residual factors for significantly intense reflections | 0.1099 |
Weighted residual factors for all reflections included in the refinement | 0.1166 |
Goodness-of-fit parameter for all reflections included in the refinement | 1.011 |
Diffraction radiation wavelength | 0.71073 Å |
Diffraction radiation type | MoKα |