Information card for entry 2100400
Original IUCr paper | HTML |
Formula | C48 H108 O20 P4 Re4 Th |
Calculated formula | C48 H108 O20 P4 Re4 Th |
Title of publication | Temperature-resolved study of three [<i>M</i>(<i>M</i>'O~4~)~4~(TBPO)~4~] complexes (<i>MM</i>' = URe, ThRe, ThTc) |
Authors of publication | M. Helliwell; D. Collison; G. H. John; I. May; M. J. Sarsfield; C. A. Sharrad; A. D. Sutton |
Journal of publication | Acta Crystallographica Section B |
Year of publication | 2006 |
Journal volume | 62 |
Journal issue | 1 |
Pages of publication | 68 - 85 |
a | 21.61 ± 0.003 Å |
b | 21.623 ± 0.003 Å |
c | 14.8324 ± 0.0019 Å |
α | 90° |
β | 90° |
γ | 90° |
Cell volume | 6930.8 ± 1.6 Å3 |
Cell temperature | 165 ± 2 K |
Ambient diffraction temperature | 165 ± 2 K |
Number of distinct elements | 6 |
Space group number | 36 |
Hermann-Mauguin space group symbol | C m c 21 |
Hall space group symbol | C 2c -2 |
Residual factor for all reflections | 0.026 |
Residual factor for significantly intense reflections | 0.0255 |
Weighted residual factors for significantly intense reflections | 0.0535 |
Weighted residual factors for all reflections included in the refinement | 0.0539 |
Goodness-of-fit parameter for all reflections included in the refinement | 1.06 |
Diffraction radiation wavelength | 0.71073 Å |
Diffraction radiation type | MoKα |