Information card for entry 2100670
Original IUCr paper | HTML |
Common name | ethylenediamine |
Chemical name | 1,2-diaminoethane phase I gamma |
Formula | C2 H8 N2 |
Calculated formula | C2 H8 N2 |
SMILES | NCCN |
Title of publication | Competing hydrogen-bonding patterns and phase transitions of 1,2-diaminoethane at varied temperature and pressure |
Authors of publication | Budzianowski, Armand; Olejniczak, Anna; Katrusiak, Andrzej |
Journal of publication | Acta Crystallographica Section B |
Year of publication | 2006 |
Journal volume | 62 |
Journal issue | 6 |
Pages of publication | 1078 - 1089 |
a | 9.69 ± 0.1 Å |
b | 7.488 ± 0.005 Å |
c | 4.849 ± 0.014 Å |
α | 90° |
β | 114 ± 0.7° |
γ | 90° |
Cell volume | 321 ± 4 Å3 |
Cell temperature | 296 ± 2 K |
Ambient diffraction temperature | 296 ± 2 K |
Number of distinct elements | 3 |
Space group number | 14 |
Hermann-Mauguin space group symbol | P 1 21/c 1 |
Hall space group symbol | -P 2ybc |
Residual factor for all reflections | 0.241 |
Residual factor for significantly intense reflections | 0.2374 |
Weighted residual factors for significantly intense reflections | 0.4312 |
Weighted residual factors for all reflections included in the refinement | 0.4331 |
Goodness-of-fit parameter for all reflections included in the refinement | 1.393 |
Diffraction radiation wavelength | 0.71073 Å |
Diffraction radiation type | MoKα |