Information card for entry 2100722
Original IUCr paper | HTML |
Formula | Ba0.14 Nb2 O6 Sr0.86 |
Calculated formula | Ba0.14256 Nb2 O6 Sr0.85748 |
Title of publication | Structure of strontium barium niobate Sr~<i>x~</i>Ba~1{-~<i>x</i>}Nb~2~O~6~ (SBN) in the composition range 0.32 {łeq} <i>x</i> {łeq} 0.82 |
Authors of publication | Podlozhenov, Sergey; Graetsch, Heribert A.; Schneider, Julius; Ulex, Michael; Woehlecke, Manfred; Betzler, Klaus |
Journal of publication | Acta Crystallographica Section B |
Year of publication | 2006 |
Journal volume | 62 |
Journal issue | 6 |
Pages of publication | 960 - 965 |
a | 12.4179 ± 0.0009 Å |
b | 12.4179 ± 0.0009 Å |
c | 3.9074 ± 0.0005 Å |
α | 90° |
β | 90° |
γ | 90° |
Cell volume | 602.54 ± 0.1 Å3 |
Cell temperature | 298 ± 2 K |
Ambient diffraction temperature | 298 ± 2 K |
Number of distinct elements | 4 |
Space group number | 100 |
Hermann-Mauguin space group symbol | P 4 b m |
Hall space group symbol | P 4 -2ab |
Residual factor for all reflections | 0.0848 |
Residual factor for significantly intense reflections | 0.0451 |
Weighted residual factors for significantly intense reflections | 0.0834 |
Weighted residual factors for all reflections included in the refinement | 0.0913 |
Goodness-of-fit parameter for all reflections included in the refinement | 0.957 |
Diffraction radiation wavelength | 0.71073 Å |
Diffraction radiation type | MoKα |