Information card for entry 2100974
Formula
C22 H23 Ir N2 O4
Calculated formula
C22 H23 Ir N2 O4
Title of publication
Comparative structural studies of [(η^5^-Me~5~C~5~)Ir^I^(2,2'-bipyridine‒4,4'-COOH)] and [(η^5^-Me~5~C~5~)Ir^III^{2,2'-bipyridine-4,4'-COO(CH~2~)~3~-pyrrole}Cl]ClO~4~
Authors of publication
Ziessel, R.; Noblat-Chardon, S.; Deronzier, A.; Matt, D.; Toupet, L.; Balgroune, F.; Grandjean, D.
Journal of publication
Acta Crystallographica Section B
Year of publication
1993
Journal volume
49
Journal issue
3
Pages of publication
515 - 519
a
17.87 ± 0.005 Å
b
12.045 ± 0.004 Å
c
18.641 ± 0.003 Å
α
90°
β
100.66 ± 0.03°
γ
90°
Cell volume
3943.1 ± 1.9 Å3
Number of distinct elements
5
Hermann-Mauguin space group symbol
C 1 2/c 1
Hall space group symbol
-C 2yc
Diffraction radiation wavelength
0.70926 Å
Diffraction radiation type
Mo
Yes
No
No