Information card for entry 2102225
Original IUCr paper | HTML |
Chemical name | 2-Amino-4,6-bis(2-hydroxyethylamino)-5-nitrosopyrimidine |
Formula | C8 H14 N6 O3 |
Calculated formula | C8 H14 N6 O3 |
Title of publication | Symmetrically 4,6-disubstituted 2-aminopyrimidines and 2-amino-5-nitrosopyrimidines: interplay of molecular, molecular‒electronic and supramolecular structures |
Authors of publication | Quesada, Antonio; Marchal, Antonio; Melguizo, Manuel; Low, John N.; Glidewell, Christopher |
Journal of publication | Acta Crystallographica Section B |
Year of publication | 2004 |
Journal volume | 60 |
Journal issue | 1 |
Pages of publication | 76 - 89 |
a | 9.6487 ± 0.0001 Å |
b | 14.8594 ± 0.0002 Å |
c | 7.3497 ± 0.0002 Å |
α | 90° |
β | 101.097 ± 0.001° |
γ | 90° |
Cell volume | 1034.05 ± 0.03 Å3 |
Cell temperature | 120 ± 2 K |
Ambient diffraction temperature | 120 ± 2 K |
Number of distinct elements | 4 |
Space group number | 14 |
Hermann-Mauguin space group symbol | P 1 21/c 1 |
Hall space group symbol | -P 2ybc |
Residual factor for all reflections | 0.078 |
Residual factor for significantly intense reflections | 0.0656 |
Weighted residual factors for significantly intense reflections | 0.169 |
Weighted residual factors for all reflections included in the refinement | 0.1804 |
Goodness-of-fit parameter for all reflections included in the refinement | 1.039 |
Diffraction radiation wavelength | 0.71073 Å |
Diffraction radiation type | MoKα |