Information card for entry 2102235
Original IUCr paper | HTML |
Formula | C18 H30 N12 O14 Sr |
Calculated formula | C18 H30 N12 O14 Sr |
SMILES | c1(nc(c(N=O)c(=O)n1C)N)NCC(=O)NCC(=O)[O-].[Sr+2].O.O.c1(nc(c(N=O)c(=O)n1C)N)NCC(=O)NCC(=O)[O-].O.O |
Title of publication | Hydrated metal(II) complexes of <i>N</i>-(6-amino-3,4-dihydro-3-methyl-5-nitroso-4-oxopyrimidin-2-yl) derivatives of glycine, glycylglycine, threonine, serine, valine and methionine: a monomeric complex and coordination polymers in one, two and three dimensions linked by hydrogen bonding |
Authors of publication | Godino Salido, M. Luz; Arranz Mascarós, Paloma; López Garzón, Rafael; Gutiérrez Valero, M. Dolores; Low, John N.; Gallagher, John F.; Glidewell, Christopher |
Journal of publication | Acta Crystallographica Section B |
Year of publication | 2004 |
Journal volume | 60 |
Journal issue | 1 |
Pages of publication | 46 - 64 |
a | 12.9517 ± 0.0003 Å |
b | 7.702 ± 0.0002 Å |
c | 26.5416 ± 0.0007 Å |
α | 90° |
β | 97.277 ± 0.0012° |
γ | 90° |
Cell volume | 2626.3 ± 0.11 Å3 |
Cell temperature | 120 ± 2 K |
Ambient diffraction temperature | 120 ± 2 K |
Number of distinct elements | 5 |
Space group number | 15 |
Hermann-Mauguin space group symbol | C 1 2/c 1 |
Hall space group symbol | -C 2yc |
Residual factor for all reflections | 0.0681 |
Residual factor for significantly intense reflections | 0.0486 |
Weighted residual factors for significantly intense reflections | 0.126 |
Weighted residual factors for all reflections included in the refinement | 0.1344 |
Goodness-of-fit parameter for all reflections included in the refinement | 1.045 |
Diffraction radiation wavelength | 0.71073 Å |
Diffraction radiation type | MoKα |