Information card for entry 2102502
Original IUCr paper | HTML |
Chemical name | 1-phenyl-4-nitro-5-bromo-imidazole |
Formula | C10 H8 Br N3 O2 |
Calculated formula | C10 H8 Br N3 O2 |
SMILES | c1(n(c(c(n1)N(=O)=O)Br)c1ccccc1)C |
Title of publication | Structural phase transitions, and Br···N and Br···Br interactions in 1-phenyl-2-methyl-4-nitro-5-bromoimidazole |
Authors of publication | Kubicki, Maciej |
Journal of publication | Acta Crystallographica Section B |
Year of publication | 2004 |
Journal volume | 60 |
Journal issue | 3 |
Pages of publication | 333 - 342 |
a | 7.018 ± 0.0014 Å |
b | 6.916 ± 0.0012 Å |
c | 11.546 ± 0.002 Å |
α | 90° |
β | 106.41 ± 0.015° |
γ | 90° |
Cell volume | 537.57 ± 0.17 Å3 |
Cell temperature | 250 ± 1 K |
Ambient diffraction temperature | 250 ± 1 K |
Number of distinct elements | 5 |
Space group number | 11 |
Hermann-Mauguin space group symbol | P 1 21/m 1 |
Hall space group symbol | -P 2yb |
Residual factor for all reflections | 0.0576 |
Residual factor for significantly intense reflections | 0.0422 |
Weighted residual factors for significantly intense reflections | 0.0917 |
Weighted residual factors for all reflections included in the refinement | 0.0996 |
Goodness-of-fit parameter for all reflections included in the refinement | 0.999 |
Diffraction radiation wavelength | 0.71073 Å |
Diffraction radiation type | MoKα |