Information card for entry 2102531
Original IUCr paper | HTML |
Chemical name | Dichloro-(S-methyl beta-N-((2-hydroxyphenyl)ethylidene)dithiocarbazato)-bis (triphenylphosphine)-rhenium(v) |
Formula | C38 H33 Cl2 N2 P2 Re S2 |
Calculated formula | C38 Cl2 N2 P2 Re S2 |
Title of publication | 30 Space-group corrections: two examples of false polymorphism and one of incorrect interpretation of the fine details of an IR spectrum |
Authors of publication | Prof. Clemente Dore Augusto; Prof. Marzotto Armando |
Journal of publication | Acta Crystallographica Section B |
Year of publication | 2004 |
Journal volume | 60 |
Journal issue | 3 |
Pages of publication | 287 - 292 |
a | 17.514 ± 0.004 Å |
b | 10.639 ± 0.002 Å |
c | 20.106 ± 0.004 Å |
α | 90° |
β | 102.29 ± 0.03° |
γ | 90° |
Cell volume | 3660.5 ± 1.4 Å3 |
Cell temperature | 0 K |
Ambient diffraction temperature | 293 ± 2 K |
Number of distinct elements | 7 |
Space group number | 15 |
Hermann-Mauguin space group symbol | C 1 2/c 1 |
Hall space group symbol | -C 2yc |
Residual factor for all reflections | 0.0498 |
Residual factor for significantly intense reflections | 0.0492 |
Weighted residual factors for significantly intense reflections | 0.2545 |
Weighted residual factors for all reflections included in the refinement | 0.2588 |
Goodness-of-fit parameter for all reflections included in the refinement | 1.182 |
Diffraction radiation wavelength | 0.7107 Å |
Diffraction radiation type | MoKα |