Information card for entry 2102603
Original IUCr paper | HTML |
Chemical name | N-(4-chlorobenzylidene)-4-methylaniline |
Formula | C14 H12 Cl N |
Calculated formula | C14 H12 Cl N |
Title of publication | Conformational change of <i>N</i>-benzylideneanilines in crystals |
Authors of publication | Harada, Jun; Harakawa, Mayuko; Ogawa, Keiichiro |
Journal of publication | Acta Crystallographica Section B |
Year of publication | 2004 |
Journal volume | 60 |
Journal issue | 5 |
Pages of publication | 589 - 597 |
a | 5.8827 ± 0.0006 Å |
b | 7.1953 ± 0.0007 Å |
c | 13.6919 ± 0.0014 Å |
α | 90° |
β | 99.385 ± 0.002° |
γ | 90° |
Cell volume | 571.79 ± 0.1 Å3 |
Cell temperature | 90 K |
Ambient diffraction temperature | 90 K |
Number of distinct elements | 4 |
Space group number | 14 |
Hermann-Mauguin space group symbol | P 1 21/a 1 |
Hall space group symbol | -P 2yab |
Residual factor for all reflections | 0.0628 |
Residual factor for significantly intense reflections | 0.0591 |
Weighted residual factors for significantly intense reflections | 0.1378 |
Weighted residual factors for all reflections included in the refinement | 0.1414 |
Goodness-of-fit parameter for all reflections included in the refinement | 0.602 |
Diffraction radiation wavelength | 0.71073 Å |
Diffraction radiation type | MoKα |