Information card for entry 2102620
Original IUCr paper | HTML |
Formula | C10 H14 Br2 Cl6 N2 O2 Pt |
Calculated formula | C10 H14 Br2 Cl6 N2 O2 Pt |
SMILES | c1[nH+]cccc1Br.O.Cl[Pt](Cl)(Cl)(Cl)([Cl-])[Cl-].c1c(ccc[nH+]1)Br.O |
Title of publication | Water molecules insert into N—H···Cl—<i>M</i> hydrogen bonds while <i>M</i>—Cl···<i>X</i>—C halogen bonds remain intact in dihydrates of halopyridinium hexachloroplatinates |
Authors of publication | Zordan, Fiorenzo; Brammer, Lee |
Journal of publication | Acta Crystallographica Section B |
Year of publication | 2004 |
Journal volume | 60 |
Journal issue | 5 |
Pages of publication | 512 - 519 |
a | 10.634 ± 0.001 Å |
b | 9.131 ± 0.001 Å |
c | 11.03 ± 0.001 Å |
α | 90° |
β | 108.076 ± 0.002° |
γ | 90° |
Cell volume | 1018.14 ± 0.17 Å3 |
Cell temperature | 150 ± 5 K |
Ambient diffraction temperature | 150 ± 2 K |
Number of distinct elements | 7 |
Space group number | 14 |
Hermann-Mauguin space group symbol | P 1 21/n 1 |
Hall space group symbol | -P 2yn |
Residual factor for all reflections | 0.0283 |
Residual factor for significantly intense reflections | 0.0235 |
Weighted residual factors for significantly intense reflections | 0.0662 |
Weighted residual factors for all reflections included in the refinement | 0.0688 |
Goodness-of-fit parameter for all reflections included in the refinement | 0.997 |
Diffraction radiation wavelength | 0.71073 Å |
Diffraction radiation type | MoKα |