Information card for entry 2102649
Original IUCr paper | HTML |
Formula | C58 H70 N18 O P6 |
Calculated formula | C58 H70 N18 O P6 |
Title of publication | Structural investigations of phosphorus‒nitrogen compounds. 6. Relationships between molecular parameters in per-<i>X</i>-substituted bridged spermine derivatives and basicity constants Σα<i>R</i> of substituents |
Authors of publication | Coles, Simon J; Davies, David B.; Hursthouse, Michael B.; Kiliç, Adem; Mayer, Thomas A.; Shaw, Robert A.; Yenilmez Çiftçi, Gonul |
Journal of publication | Acta Crystallographica Section B |
Year of publication | 2004 |
Journal volume | 60 |
Journal issue | 6 |
Pages of publication | 739 - 747 |
a | 13.112 ± 0.003 Å |
b | 15.16 ± 0.003 Å |
c | 17.546 ± 0.004 Å |
α | 81.67 ± 0.03° |
β | 74.73 ± 0.03° |
γ | 67.08 ± 0.03° |
Cell volume | 3095.5 ± 1.4 Å3 |
Cell temperature | 150 ± 2 K |
Ambient diffraction temperature | 150 ± 2 K |
Number of distinct elements | 5 |
Space group number | 2 |
Hermann-Mauguin space group symbol | P -1 |
Hall space group symbol | -P 1 |
Residual factor for all reflections | 0.221 |
Residual factor for significantly intense reflections | 0.0662 |
Weighted residual factors for significantly intense reflections | 0.1213 |
Weighted residual factors for all reflections included in the refinement | 0.1683 |
Goodness-of-fit parameter for all reflections included in the refinement | 0.934 |
Diffraction radiation wavelength | 0.71073 Å |
Diffraction radiation type | MoKα |