Information card for entry 2105125
Original IUCr paper | HTML |
Formula | C21 H26 Cl N O |
Calculated formula | C21 H26 Cl N O |
SMILES | Clc1cccc(/N=C/c2c(O)c(cc(c2)C(C)(C)C)C(C)(C)C)c1 |
Title of publication | Relation between photochromic properties and molecular structures in salicylideneaniline crystals |
Authors of publication | Johmoto, Kohei; Ishida, Takashi; Sekine, Akiko; Uekusa, Hidehiro; Ohashi, Yuji |
Journal of publication | Acta Crystallographica Section B |
Year of publication | 2012 |
Journal volume | 68 |
Journal issue | 3 |
Pages of publication | 297 - 304 |
a | 10.7392 ± 0.0012 Å |
b | 11.5369 ± 0.0015 Å |
c | 16.1292 ± 0.0019 Å |
α | 88.032 ± 0.003° |
β | 82.446 ± 0.003° |
γ | 89.642 ± 0.003° |
Cell volume | 1979.8 ± 0.4 Å3 |
Cell temperature | 296 ± 2 K |
Ambient diffraction temperature | 296 ± 2 K |
Number of distinct elements | 5 |
Space group number | 2 |
Hermann-Mauguin space group symbol | P -1 |
Hall space group symbol | -P 1 |
Residual factor for all reflections | 0.1741 |
Residual factor for significantly intense reflections | 0.0641 |
Weighted residual factors for significantly intense reflections | 0.1232 |
Weighted residual factors for all reflections included in the refinement | 0.1644 |
Goodness-of-fit parameter for all reflections included in the refinement | 1.02 |
Diffraction radiation wavelength | 0.71075 Å |
Diffraction radiation type | MoKα |