Information card for entry 2105284
Original IUCr paper | HTML |
Formula | Ca5 Cl0.18 H0.82 O12.82 P3 |
Calculated formula | Ca5 Cl0.18 H0.82 O12.83 P3 |
Title of publication | Cl‒OH ion-exchanging process in chlorapatite (Ca~5~(PO~4~)~3~Cl~<i>x~</i>(OH)~1{-~<i>x</i>}) ‒ a deep insight |
Authors of publication | García-Tuñón, Esther; Dacuña, Bruno; Zaragoza, Guillermo; Franco, Jaime; Guitián, Francisco |
Journal of publication | Acta Crystallographica Section B |
Year of publication | 2012 |
Journal volume | 68 |
Journal issue | 5 |
Pages of publication | 467 - 479 |
a | 9.423 ± 0.0002 Å |
b | 9.423 ± 0.0002 Å |
c | 6.8794 ± 0.0003 Å |
α | 90° |
β | 90° |
γ | 120° |
Cell volume | 529 ± 0.03 Å3 |
Cell temperature | 293 ± 2 K |
Ambient diffraction temperature | 293 ± 2 K |
Number of distinct elements | 5 |
Space group number | 176 |
Hermann-Mauguin space group symbol | P 63/m |
Hall space group symbol | -P 6c |
Residual factor for all reflections | 0.0304 |
Residual factor for significantly intense reflections | 0.0291 |
Weighted residual factors for significantly intense reflections | 0.0677 |
Weighted residual factors for all reflections included in the refinement | 0.0683 |
Goodness-of-fit parameter for all reflections included in the refinement | 1.154 |
Diffraction radiation probe | x-ray |
Diffraction radiation wavelength | 0.7107 Å |
Diffraction radiation type | MoKα |